Reaction Details
TargetCytochrome P450 2D6
LigandBDBM50362106
Substrate/Competitorn/a
Meas. Tech.ChEMBL_813722 (CHEMBL2019924)
IC50>20000±n/a nM
Citation Huang, XShipps, GWCheng, CCSpacciapoli, PZhang, XMcCoy, MAWyss, DFYang, XAchab, ASoucy, KMontavon, DKMurphy, DMWhitehurst, CE Discovery and Hit-to-Lead Optimization of Non-ATP Competitive MK2 (MAPKAPK2) Inhibitors. ACS Med Chem Lett2:632-637 (2011) 
 
Cytochrome P450 2D6
Name:Cytochrome P450 2D6
Type:Protein
Mol. Mass.:55774.82
Organism:Homo sapiens (Human)
Description:P10635
Residue:497
BDBM50362106
NameBDBM50362106
Synonyms:CHEMBL1938681
TypeSmall organic molecule
Emp. Form.C27H25ClN4O2
Mol. Mass.472.966
SMILESClc1ccc(cc1)-c1ccc(o1)C(=O)N(Cc1ccccn1)c1ccc(cc1)N1CCNCC1