Reaction Details
TargetHepatocyte growth factor receptor
LigandBDBM50362169
Substrate/Competitorn/a
Meas. Tech.ChEMBL_813708 (CHEMBL2019910)
IC50>30000±n/a nM
Citation Huang, XShipps, GWCheng, CCSpacciapoli, PZhang, XMcCoy, MAWyss, DFYang, XAchab, ASoucy, KMontavon, DKMurphy, DMWhitehurst, CE Discovery and Hit-to-Lead Optimization of Non-ATP Competitive MK2 (MAPKAPK2) Inhibitors. ACS Med Chem Lett2:632-637 (2011) 
 
Hepatocyte growth factor receptor
Name:Hepatocyte growth factor receptor
Type:Protein
Mol. Mass.:155559.73
Organism:Homo sapiens (Human)
Description:P08581
Residue:1390
BDBM50362169
NameBDBM50362169
Synonyms:CHEMBL1938680
TypeSmall organic molecule
Emp. Form.C21H20ClN3O2
Mol. Mass.381.855
SMILESClc1ccc(cc1)-c1ccc(o1)C(=O)Nc1ccc(cc1)N1CCNCC1