Reaction Details
TargetXanthine dehydrogenase/oxidase
LigandBDBM35440
Substrate/Competitorn/a
Meas. Tech.ChEMBL_817327 (CHEMBL2026295)
IC50 5700±n/a nM
Citation B-Rao, CKulkarni-Almeida, AKatkar, KVKhanna, SGhosh, UKeche, AShah, PSrivastava, AKorde, VNemmani, KVDeshmukh, NJDixit, ABrahma, MKBahirat, UDoshi, LSharma, RSivaramakrishnan, H Identification of novel isocytosine derivatives as xanthine oxidase inhibitors from a set of virtual screening hits. Bioorg Med Chem20:2930-9 (2012) 
 
Xanthine dehydrogenase/oxidase
Name:Xanthine dehydrogenase/oxidase
Type:Protein
Mol. Mass.:146809.00
Organism:Bos taurus (Bovine)
Description:P80457
Residue:1332
BDBM35440
NameBDBM35440
Synonyms:ALLOPURINOL SMR000059083 | cid_2094
TypeSmall organic molecule
Emp. Form.C5H4N4O
Mol. Mass.136.1115
SMILESO=c1[nH]cnc2n[nH]cc12