Reaction Details
TargetLysosomal Pro-X carboxypeptidase
LigandBDBM50382886
Substrate/Competitorn/a
Meas. Tech.ChEMBL_815280 (CHEMBL2026495)
IC50 10±n/a nM
Citation Graham, THLiu, WVerras, ASebhat, IKXiong, YBleasby, KBhatt, URChen, QGarcia-Calvo, MGeissler, WMGorski, JNHe, HLassman, MELisnock, JLi, XShen, ZTong, XTung, ECWiltsie, JXiao, JXie, DXu, SHale, JJPinto, SShen, DM A new class of prolylcarboxypeptidase inhibitors, part 1: discovery and evaluation. Bioorg Med Chem Lett22:2811-7 (2012) 
 
Lysosomal Pro-X carboxypeptidase
Name:Lysosomal Pro-X carboxypeptidase
Type:PROTEIN
Mol. Mass.:55028.96
Organism:Mus musculus
Description:ChEMBL_1335505
Residue:491
BDBM50382886
NameBDBM50382886
Synonyms:CHEMBL2024198 | US8569299, 23
TypeSmall organic molecule
Emp. Form.C30H36ClF2N5O
Mol. Mass.556.09
SMILESCc1nc(C2CCN(CC2)C(=O)[C@@H]2CN(C[C@H]2c2ccc(F)cc2F)C(C)(C)C)n(n1)-c1ccc(Cl)c(C)c1