Reaction Details
TargetLysosomal Pro-X carboxypeptidase
LigandBDBM50382904
Substrate/Competitorn/a
Meas. Tech.ChEMBL_815279 (CHEMBL2026494)
IC50 0.2±n/a nM
Citation Graham, THLiu, WVerras, ASebhat, IKXiong, YBleasby, KBhatt, URChen, QGarcia-Calvo, MGeissler, WMGorski, JNHe, HLassman, MELisnock, JLi, XShen, ZTong, XTung, ECWiltsie, JXiao, JXie, DXu, SHale, JJPinto, SShen, DM A new class of prolylcarboxypeptidase inhibitors, part 1: discovery and evaluation. Bioorg Med Chem Lett22:2811-7 (2012) 
 
Lysosomal Pro-X carboxypeptidase
Name:Lysosomal Pro-X carboxypeptidase
Type:Enzyme
Mol. Mass.:55805.19
Organism:Homo sapiens (Human)
Description:P42785
Residue:496
BDBM50382904
NameBDBM50382904
Synonyms:CHEMBL2022793
TypeSmall organic molecule
Emp. Form.C30H34Cl2F2N4O
Mol. Mass.575.52
SMILESCc1cc(C2CCN(CC2)C(=O)[C@@H]2CN(C[C@H]2c2ccc(F)cc2F)C(C)(C)C)n(n1)-c1ccc(Cl)c(Cl)c1