Reaction Details
TargetAurora kinase B
LigandBDBM50384174
Substrate/Competitorn/a
Meas. Tech.ChEMBL_820049 (CHEMBL2032822)
IC50 18±n/a nM
Citation Le Brazidec, JYPasis, ATam, BBoykin, CWang, DMarcotte, DJClaassen, GChong, JHChao, JFan, JNguyen, KSilvian, LLing, LZhang, LChoi, MTeng, MPathan, NZhao, SLi, TTaveras, A Structure-based design of 2,6,7-trisubstituted-7H-pyrrolo[2,3-d]pyrimidines as Aurora kinases inhibitors. Bioorg Med Chem Lett22:4033-7 (2012) 
 
Aurora kinase B
Name:Aurora kinase B
Type:Protein
Mol. Mass.:39327.72
Organism:Homo sapiens (Human)
Description:Q96GD4
Residue:344
BDBM50384174
NameBDBM50384174
Synonyms:CHEMBL2029902
TypeSmall organic molecule
Emp. Form.C22H29N7O
Mol. Mass.407.512
SMILESCN1CCN(CC1)C(=O)c1cc(Nc2ncc3ccn(C4CCCC4)c3n2)cn1C