Reaction Details
TargetBcl-2-like protein 1
LigandBDBM50384312
Substrate/Competitorn/a
Meas. Tech.ChEMBL_818166 (CHEMBL2033943)
IC50 11±n/a nM
Citation Schroeder, GMWei, DBanfi, PCai, ZWLippy, JMenichincheri, MModugno, MNaglich, JPenhallow, BPerez, HLSack, JSchmidt, RJTebben, AYan, CZhang, LGalvani, ALombardo, LJBorzilleri, RM Pyrazole and pyrimidine phenylacylsulfonamides as dual Bcl-2/Bcl-xL antagonists. Bioorg Med Chem Lett22:3951-6 (2012) 
 
Bcl-2-like protein 1
Name:Bcl-2-like protein 1
Type:Mitochondrion membrane; Single-pass membrane protein
Mol. Mass.:26039.60
Organism:Homo sapiens (Human)
Description:n/a
Residue:233
BDBM50384312
NameBDBM50384312
Synonyms:CHEMBL2030847
TypeSmall organic molecule
Emp. Form.C41H38N4O5S
Mol. Mass.698.829
SMILESCCCCc1c(c(CO)nn1-c1ccccc1)-c1ccc(cc1C(=O)N1CCc2ccccc2C1)C(=O)NS(=O)(=O)c1ccc2ccccc2c1