Reaction Details
TargetBcl-2-like protein 1
LigandBDBM50384326
Substrate/Competitorn/a
Meas. Tech.ChEMBL_818166 (CHEMBL2033943)
IC50 13±n/a nM
Citation Schroeder, GMWei, DBanfi, PCai, ZWLippy, JMenichincheri, MModugno, MNaglich, JPenhallow, BPerez, HLSack, JSchmidt, RJTebben, AYan, CZhang, LGalvani, ALombardo, LJBorzilleri, RM Pyrazole and pyrimidine phenylacylsulfonamides as dual Bcl-2/Bcl-xL antagonists. Bioorg Med Chem Lett22:3951-6 (2012) 
 
Bcl-2-like protein 1
Name:Bcl-2-like protein 1
Type:Mitochondrion membrane; Single-pass membrane protein
Mol. Mass.:26039.60
Organism:Homo sapiens (Human)
Description:n/a
Residue:233
BDBM50384326
NameBDBM50384326
Synonyms:CHEMBL2030861
TypeSmall organic molecule
Emp. Form.C36H44N4O5SSi
Mol. Mass.672.909
SMILESCCCCc1c(c(CO)nn1-c1ccccc1)-c1ccc(cc1C(=O)N1CCc2ccccc2C1)C(=O)NS(=O)(=O)CC[Si](C)(C)C