Reaction Details
TargetApoptosis regulator Bcl-2
LigandBDBM50384340
Substrate/Competitorn/a
Meas. Tech.ChEMBL_818165 (CHEMBL2033942)
IC50 9±n/a nM
Citation Schroeder, GMWei, DBanfi, PCai, ZWLippy, JMenichincheri, MModugno, MNaglich, JPenhallow, BPerez, HLSack, JSchmidt, RJTebben, AYan, CZhang, LGalvani, ALombardo, LJBorzilleri, RM Pyrazole and pyrimidine phenylacylsulfonamides as dual Bcl-2/Bcl-xL antagonists. Bioorg Med Chem Lett22:3951-6 (2012) 
 
Apoptosis regulator Bcl-2
Name:Apoptosis regulator Bcl-2
Type:Homodimer or heterodimer
Mol. Mass.:26269.11
Organism:Homo sapiens (Human)
Description:P10415
Residue:239
BDBM50384340
NameBDBM50384340
Synonyms:CHEMBL2031009 | US9346795, 328
TypeSmall organic molecule
Emp. Form.C38H37Cl2N5O5S
Mol. Mass.746.702
SMILESCCCN(CCC)c1ncc(Cl)c(n1)-c1ccc(cc1C(=O)N1Cc2ccccc2C[C@H]1CO)C(=O)NS(=O)(=O)c1ccc2cccc(Cl)c2c1