Reaction Details
TargetApoptosis regulator Bcl-2
LigandBDBM50384322
Substrate/Competitorn/a
Meas. Tech.ChEMBL_818165 (CHEMBL2033942)
IC50 14±n/a nM
Citation Schroeder, GMWei, DBanfi, PCai, ZWLippy, JMenichincheri, MModugno, MNaglich, JPenhallow, BPerez, HLSack, JSchmidt, RJTebben, AYan, CZhang, LGalvani, ALombardo, LJBorzilleri, RM Pyrazole and pyrimidine phenylacylsulfonamides as dual Bcl-2/Bcl-xL antagonists. Bioorg Med Chem Lett22:3951-6 (2012) 
 
Apoptosis regulator Bcl-2
Name:Apoptosis regulator Bcl-2
Type:Homodimer or heterodimer
Mol. Mass.:26269.11
Organism:Homo sapiens (Human)
Description:P10415
Residue:239
BDBM50384322
NameBDBM50384322
Synonyms:CHEMBL2030857
TypeSmall organic molecule
Emp. Form.C44H44N4O6S
Mol. Mass.756.908
SMILESCCCCc1c(c(CO)nn1-c1ccc(CCCO)cc1)-c1ccc(cc1C(=O)N1CCc2ccccc2C1)C(=O)NS(=O)(=O)c1ccc2ccccc2c1