Reaction Details
TargetNeuropeptide Y receptor type 1
LigandBDBM50386376
Substrate/Competitorn/a
Meas. Tech.ChEMBL_826725 (CHEMBL2051172)
Ki 15±n/a nM
Citation Hu, SHuang, YDeshpande, MLuo, GBruce, MAChen, LMattson, GIben, LGZhang, JRussell, JWClarke, WJHogan, JBOrtiz, AFlint, OHenwood, AGao, QAntal-Zimanyi, IPoindexter, GS Discovery of a Novel Class of Bicyclo[3.1.0]hexanylpiperazines as Noncompetitive Neuropeptide Y Y1 Antagonists. ACS Med Chem Lett3:222-226 (2012) 
 
Neuropeptide Y receptor type 1
Name:Neuropeptide Y receptor type 1
Type:Enzyme Catalytic Domain
Mol. Mass.:44399.07
Organism:Homo sapiens (Human)
Description:NPY-Y1 NPY1R HUMAN::P25929
Residue:384
BDBM50386376
NameBDBM50386376
Synonyms:CHEMBL2046865
TypeSmall organic molecule
Emp. Form.C29H34N4O3
Mol. Mass.486.6053
SMILES[#7]\[#6](-[#7])=[#7]\[#6]-[#6]-[#6]-[#6]-[#6@@H](-[#7]-[#6](=O)-[#6](-c1ccccc1)-c1ccccc1)-[#6](=O)-[#6]-[#6]-c1ccc(-[#8])cc1