Reaction Details
TargetRAF proto-oncogene serine/threonine-protein kinase
LigandBDBM50386475
Substrate/Competitorn/a
Meas. Tech.ChEMBL_827186 (CHEMBL2050520)
IC50 73±n/a nM
Citation Mathieu, SGradl, SNRen, LWen, ZAliagas, IGunzner-Toste, JLee, WPulk, RZhao, GAlicke, BBoggs, JWBuckmelter, AJChoo, EFDinkel, VGloor, SLGould, SEHansen, JDHastings, GHatzivassiliou, GLaird, ERMoreno, DRan, YVoegtli, WCWenglowsky, SGrina, JRudolph, J Potent and selective aminopyrimidine-based B-Raf inhibitors with favorable physicochemical and pharmacokinetic properties. J Med Chem55:2869-81 (2012) 
 
RAF proto-oncogene serine/threonine-protein kinase
Name:RAF proto-oncogene serine/threonine-protein kinase
Type:Serine/threonine-protein kinase
Mol. Mass.:73082.52
Organism:Homo sapiens (Human)
Description:P04049
Residue:648
BDBM50386475
NameBDBM50386475
Synonyms:CHEMBL2047879
TypeSmall organic molecule
Emp. Form.C16H14ClF2N5O3S2
Mol. Mass.461.894
SMILESNc1ncnc2c(csc12)C(=O)Nc1c(Cl)ccc(NS(=O)(=O)CCCF)c1F