Reaction Details
TargetSerine/threonine-protein kinase pim-2
LigandBDBM50387309
Substrate/Competitorn/a
Meas. Tech.ChEMBL_828046 (CHEMBL2049740)
IC50 14±n/a nM
Citation Dakin, LABlock, MHChen, HCode, EDowling, JEFeng, XFerguson, ADGreen, IHird, AWHoward, TKeeton, EKLamb, MLLyne, PDPollard, HRead, JWu, AJZhang, TZheng, X Discovery of novel benzylidene-1,3-thiazolidine-2,4-diones as potent and selective inhibitors of the PIM-1, PIM-2, and PIM-3 protein kinases. Bioorg Med Chem Lett22:4599-604 (2012) 
 
Serine/threonine-protein kinase pim-2
Name:Serine/threonine-protein kinase pim-2
Type:Serine/threonine-protein kinase
Mol. Mass.:34185.93
Organism:Homo sapiens (Human)
Description:Q9P1W9
Residue:311
BDBM50387309
NameBDBM50387309
Synonyms:CHEMBL2048865
TypeSmall organic molecule
Emp. Form.C15H17N3O2S
Mol. Mass.303.379
SMILESN[C@@H]1CCCN(C1)c1ccccc1C=C1SC(O)=NC1=O