Reaction Details
TargetMelanin-concentrating hormone receptor 1
LigandBDBM50388442
Substrate/Competitorn/a
Meas. Tech.ChEMBL_829935 (CHEMBL2061640)
IC50 2.6±n/a nM
Citation Kasai, SKamata, MMasada, SKunitomo, JKamaura, MOkawa, TTakami, KOgino, HNakano, YAshina, SWatanabe, KKaisho, TImai, YNRyu, SNakayama, MNagisa, YTakekawa, SKato, KMurata, TSuzuki, NIshihara, Y Synthesis, structure-activity relationship, and pharmacological studies of novel melanin-concentrating hormone receptor 1 antagonists 3-aminomethylquinolines: reducing human ether-a-go-go-related gene (hERG) associated liabilities. J Med Chem55:4336-51 (2012) 
 
Melanin-concentrating hormone receptor 1
Name:Melanin-concentrating hormone receptor 1
Type:G Protein-Coupled Receptor (GPCR)
Mol. Mass.:45976.27
Organism:Homo sapiens (Human)
Description:Membranes from CHO-K1 cells stably expressing human MCH1R were used in assays.
Residue:422
BDBM50388442
NameBDBM50388442
Synonyms:CHEMBL2059408
TypeSmall organic molecule
Emp. Form.C26H31N3O2
Mol. Mass.417.5432
SMILESCCCCOc1ccc(cc1)C(=O)Nc1ccc2cc(CN3CCCC3)cnc2c1C