Reaction Details
TargetMelanin-concentrating hormone receptor 1
LigandBDBM50388450
Substrate/Competitorn/a
Meas. Tech.ChEMBL_829933 (CHEMBL2061638)
IC50 1.7±n/a nM
Citation Kasai, SKamata, MMasada, SKunitomo, JKamaura, MOkawa, TTakami, KOgino, HNakano, YAshina, SWatanabe, KKaisho, TImai, YNRyu, SNakayama, MNagisa, YTakekawa, SKato, KMurata, TSuzuki, NIshihara, Y Synthesis, structure-activity relationship, and pharmacological studies of novel melanin-concentrating hormone receptor 1 antagonists 3-aminomethylquinolines: reducing human ether-a-go-go-related gene (hERG) associated liabilities. J Med Chem55:4336-51 (2012) 
 
Melanin-concentrating hormone receptor 1
Name:Melanin-concentrating hormone receptor 1
Type:G Protein-Coupled Receptor (GPCR)
Mol. Mass.:45976.27
Organism:Homo sapiens (Human)
Description:Membranes from CHO-K1 cells stably expressing human MCH1R were used in assays.
Residue:422
BDBM50388450
NameBDBM50388450
Synonyms:CHEMBL2059418
TypeSmall organic molecule
Emp. Form.C27H31N3O2
Mol. Mass.429.5539
SMILESCC(N1CCCC1)c1cnc2c(C)c(NC(=O)c3ccc(OCC4CC4)cc3)ccc2c1