Reaction Details
TargetInterstitial collagenase
LigandBDBM50388912
Substrate/Competitorn/a
Meas. Tech.ChEMBL_831065 (CHEMBL2065766)
Ki 205000±n/a nM
Citation Lee, MIkejiri, MKlimpel, DToth, MEspahbodi, MHesek, DForbes, CKumarasiri, MNoll, BCChang, MMobashery, S Structure-Activity Relationship for Thiirane-Based Gelatinase Inhibitors. ACS Med Chem Lett3:490-495 (2012) 
 
Interstitial collagenase
Name:Interstitial collagenase
Type:Enzyme
Mol. Mass.:54010.26
Organism:Homo sapiens (Human)
Description: P03956
Residue:469
BDBM50388912
NameBDBM50388912
Synonyms:CHEMBL2063273
TypeSmall organic molecule
Emp. Form.C16H16O4S2
Mol. Mass.336.426
SMILESOCc1ccc(Oc2ccc(cc2)S(=O)(=O)CC2CS2)cc1