Reaction Details
TargetMatrix metalloproteinase-9
LigandBDBM50264809
Substrate/Competitorn/a
Meas. Tech.ChEMBL_831079 (CHEMBL2065780)
Ki 600±n/a nM
Citation Lee, MIkejiri, MKlimpel, DToth, MEspahbodi, MHesek, DForbes, CKumarasiri, MNoll, BCChang, MMobashery, S Structure-Activity Relationship for Thiirane-Based Gelatinase Inhibitors. ACS Med Chem Lett3:490-495 (2012) 
 
Matrix metalloproteinase-9
Name:Matrix metalloproteinase-9
Type:Enzyme
Mol. Mass.:78452.28
Organism:Homo sapiens (Human)
Description:P14780
Residue:707
BDBM50264809
NameBDBM50264809
Synonyms:2-((4-phenoxyphenylsulfonyl)methyl)thiirane Thiirane (deuterium), 1-d2 US10357546, SB-3CT
TypeSmall organic molecule
Emp. Form.C15H14O3S2
Mol. Mass.306.4
SMILESO=S(=O)(CC1CS1)c1ccc(Oc2ccccc2)cc1