Reaction Details
TargetMatrix metalloproteinase-9
LigandBDBM50388914
Substrate/Competitorn/a
Meas. Tech.ChEMBL_831079 (CHEMBL2065780)
Ki 160±n/a nM
Citation Lee, MIkejiri, MKlimpel, DToth, MEspahbodi, MHesek, DForbes, CKumarasiri, MNoll, BCChang, MMobashery, S Structure-Activity Relationship for Thiirane-Based Gelatinase Inhibitors. ACS Med Chem Lett3:490-495 (2012) 
 
Matrix metalloproteinase-9
Name:Matrix metalloproteinase-9
Type:Enzyme
Mol. Mass.:78452.28
Organism:Homo sapiens (Human)
Description:P14780
Residue:707
BDBM50388914
NameBDBM50388914
Synonyms:CHEMBL2063274 | US10357546, p-OH SB-3CT
TypeSmall organic molecule
Emp. Form.C15H14O4S2
Mol. Mass.322.399
SMILESOc1ccc(Oc2ccc(cc2)S(=O)(=O)CC2CS2)cc1