Reaction Details
TargetSerine/threonine-protein kinase PAK 4
LigandBDBM50389111
Substrate/Competitorn/a
Meas. Tech.ChEMBL_832969 (CHEMBL2066924)
EC50 12.6±n/a nM
Citation Guo, CMcAlpine, IZhang, JKnighton, DDKephart, SJohnson, MCLi, HBouzida, DYang, ADong, LMarakovits, JTikhe, JRichardson, PGuo, LCKania, REdwards, MPKraynov, EChristensen, JPiraino, JLee, JDagostino, EDel-Carmen, CDeng, YLSmeal, TMurray, BW Discovery of pyrroloaminopyrazoles as novel PAK inhibitors. J Med Chem55:4728-39 (2012) 
 
Serine/threonine-protein kinase PAK 4
Name:Serine/threonine-protein kinase PAK 4
Type:Protein
Mol. Mass.:64098.01
Organism:Homo sapiens (Human)
Description:O96013
Residue:591
BDBM50389111
NameBDBM50389111
Synonyms:CHEMBL2064555
TypeSmall organic molecule
Emp. Form.C25H24N6O
Mol. Mass.424.4977
SMILESCN(C)C[C@@H](NC(=O)c1ccc2[nH]nc(-c3nc4ccccc4[nH]3)c2c1)c1ccccc1