Reaction Details
TargetSerine/threonine-protein kinase PAK 4
LigandBDBM50389113
Substrate/Competitorn/a
Meas. Tech.ChEMBL_832969 (CHEMBL2066924)
EC50 32±n/a nM
Citation Guo, CMcAlpine, IZhang, JKnighton, DDKephart, SJohnson, MCLi, HBouzida, DYang, ADong, LMarakovits, JTikhe, JRichardson, PGuo, LCKania, REdwards, MPKraynov, EChristensen, JPiraino, JLee, JDagostino, EDel-Carmen, CDeng, YLSmeal, TMurray, BW Discovery of pyrroloaminopyrazoles as novel PAK inhibitors. J Med Chem55:4728-39 (2012) 
 
Serine/threonine-protein kinase PAK 4
Name:Serine/threonine-protein kinase PAK 4
Type:Protein
Mol. Mass.:64098.01
Organism:Homo sapiens (Human)
Description:O96013
Residue:591
BDBM50389113
NameBDBM50389113
Synonyms:CHEMBL2064558
TypeSmall organic molecule
Emp. Form.C25H30N6O2
Mol. Mass.446.5447
SMILESCN(C)C[C@@H](NC(=O)N1Cc2c(NC(=O)c3ccccc3)[nH]nc2C1(C)C)c1ccccc1