Reaction Details
TargetSerine/threonine-protein kinase PAK 4
LigandBDBM50389121
Substrate/Competitorn/a
Meas. Tech.ChEMBL_832969 (CHEMBL2066924)
EC50 4±n/a nM
Citation Guo, CMcAlpine, IZhang, JKnighton, DDKephart, SJohnson, MCLi, HBouzida, DYang, ADong, LMarakovits, JTikhe, JRichardson, PGuo, LCKania, REdwards, MPKraynov, EChristensen, JPiraino, JLee, JDagostino, EDel-Carmen, CDeng, YLSmeal, TMurray, BW Discovery of pyrroloaminopyrazoles as novel PAK inhibitors. J Med Chem55:4728-39 (2012) 
 
Serine/threonine-protein kinase PAK 4
Name:Serine/threonine-protein kinase PAK 4
Type:Protein
Mol. Mass.:64098.01
Organism:Homo sapiens (Human)
Description:O96013
Residue:591
BDBM50389121
NameBDBM50389121
Synonyms:CHEMBL2064628
TypeSmall organic molecule
Emp. Form.C23H33N5O3
Mol. Mass.427.5398
SMILESCN(C)C[C@@H](OC(=O)N1Cc2c(NC(=O)C(C)(C)C)[nH]nc2C1(C)C)c1ccccc1