Reaction Details
TargetReceptor-type tyrosine-protein kinase FLT3
LigandBDBM50389222
Substrate/Competitorn/a
Meas. Tech.ChEMBL_831539 (CHEMBL2066303)
IC50 4±n/a nM
Citation Hsu, JTYeh, TKYen, SCChen, CTHsieh, SYHsu, TLu, CTChen, CHChou, LHChiu, CHChang, YITseng, YJYen, KRChao, YSLin, WHJiaang, WT 3-Phenyl-1H-5-pyrazolylamine-based derivatives as potent and efficacious inhibitors of FMS-like tyrosine kinase-3 (FLT3). Bioorg Med Chem Lett22:4654-9 (2012) 
 
Receptor-type tyrosine-protein kinase FLT3
Name:Receptor-type tyrosine-protein kinase FLT3
Type:Enzyme
Mol. Mass.:112888.62
Organism:Homo sapiens (Human)
Description:P36888
Residue:993
BDBM50389222
NameBDBM50389222
Synonyms:CHEMBL2063336
TypeSmall organic molecule
Emp. Form.C27H31N9O2
Mol. Mass.513.5941
SMILESCN1CCN(CC1)c1cc(Nc2cc(n[nH]2)-c2ccc(CNC(=O)OCc3cccnc3)cc2)nc(C)n1