Reaction Details
TargetReplicase polyprotein 1a
LigandBDBM51317
Substrate/Competitorn/a
Meas. Tech.ChEMBL_849052 (CHEMBL2150313)
IC50 11500±n/a nM
Citation Park, JYKim, JHKim, YMJeong, HJKim, DWPark, KHKwon, HJPark, SJLee, WSRyu, YB Tanshinones as selective and slow-binding inhibitors for SARS-CoV cysteine proteases. Bioorg Med Chem20:5928-35 (2012) 
 
Replicase polyprotein 1a
Name:Replicase polyprotein 1a
Type:Enzyme
Mol. Mass.:486353.36
Organism:Human SARS coronavirus (SARS-CoV)
Description:P0C6U8
Residue:4382
BDBM51317
NameBDBM51317
Synonyms:1,6-dimethylnaphtho[1,2-g][1]benzofuran-10,11-dione 1,6-dimethylnaphtho[1,2-g]benzofuran-10,11-quinone SMR000445578 acs.jmedchem.1c00409_ST.675 | cid_114917
TypeSmall organic molecule
Emp. Form.C18H12O3
Mol. Mass.276.2861
SMILESCc1coc-2c1C(=O)C(=O)c1c-2ccc2c(C)cccc12