Reaction Details
Target72 kDa type IV collagenase
LigandBDBM50392691
Substrate/Competitorn/a
Meas. Tech.ChEMBL_854272 (CHEMBL2154438)
IC50 120±n/a nM
Citation Nicolotti, OCatto, MGiangreco, IBarletta, MLeonetti, FStefanachi, APisani, LCellamare, STortorella, PLoiodice, FCarotti, A Design, synthesis and biological evaluation of 5-hydroxy, 5-substituted-pyrimidine-2,4,6-triones as potent inhibitors of gelatinases MMP-2 and MMP-9. Eur J Med Chem58:368-76 (2012) 
 
72 kDa type IV collagenase
Name:72 kDa type IV collagenase
Type:Enzyme
Mol. Mass.:73870.36
Organism:Homo sapiens (Human)
Description: P08253
Residue:660
BDBM50392691
NameBDBM50392691
Synonyms:CHEMBL2151360
TypeSmall organic molecule
Emp. Form.C19H16N2O5S
Mol. Mass.384.406
SMILESCSc1ccc(cc1)-c1ccc(cc1)C(=O)CC1(O)C(=O)NC(=O)NC1=O