Reaction Details
Target72 kDa type IV collagenase
LigandBDBM50392696
Substrate/Competitorn/a
Meas. Tech.ChEMBL_854272 (CHEMBL2154438)
IC50 181±n/a nM
Citation Nicolotti, OCatto, MGiangreco, IBarletta, MLeonetti, FStefanachi, APisani, LCellamare, STortorella, PLoiodice, FCarotti, A Design, synthesis and biological evaluation of 5-hydroxy, 5-substituted-pyrimidine-2,4,6-triones as potent inhibitors of gelatinases MMP-2 and MMP-9. Eur J Med Chem58:368-76 (2012) 
 
72 kDa type IV collagenase
Name:72 kDa type IV collagenase
Type:Enzyme
Mol. Mass.:73870.36
Organism:Homo sapiens (Human)
Description: P08253
Residue:660
BDBM50392696
NameBDBM50392696
Synonyms:CHEMBL2151365
TypeSmall organic molecule
Emp. Form.C16H12N2O5S
Mol. Mass.344.342
SMILESOC1(CC(=O)c2ccc(cc2)-c2ccsc2)C(=O)NC(=O)NC1=O