Reaction Details
TargetMatrix metalloproteinase-9
LigandBDBM50392689
Substrate/Competitorn/a
Meas. Tech.ChEMBL_854273 (CHEMBL2154439)
IC50 141±n/a nM
Citation Nicolotti, OCatto, MGiangreco, IBarletta, MLeonetti, FStefanachi, APisani, LCellamare, STortorella, PLoiodice, FCarotti, A Design, synthesis and biological evaluation of 5-hydroxy, 5-substituted-pyrimidine-2,4,6-triones as potent inhibitors of gelatinases MMP-2 and MMP-9. Eur J Med Chem58:368-76 (2012) 
 
Matrix metalloproteinase-9
Name:Matrix metalloproteinase-9
Type:Enzyme
Mol. Mass.:78452.28
Organism:Homo sapiens (Human)
Description:P14780
Residue:707
BDBM50392689
NameBDBM50392689
Synonyms:CHEMBL2151358
TypeSmall organic molecule
Emp. Form.C19H16N2O6
Mol. Mass.368.3401
SMILESCOc1ccc(cc1)-c1ccc(cc1)C(=O)CC1(O)C(=O)NC(=O)NC1=O