Reaction Details
TargetMitogen-activated protein kinase 8
LigandBDBM50392989
Substrate/Competitorn/a
Meas. Tech.ChEMBL_853501 (CHEMBL2153878)
IC50 45±n/a nM
Citation Haynes, NEScott, NRChen, LCJanson, CALi, JKLukacs, CMRailkar, ATozzo, EWhittard, TBrown, NFCheung, AW Identification of an Adamantyl Azaquinolone JNK Selective Inhibitor. ACS Med Chem Lett3:764-768 (2012) 
 
Mitogen-activated protein kinase 8
Name:Mitogen-activated protein kinase 8
Type:Enzyme
Mol. Mass.:48297.57
Organism:Homo sapiens (Human)
Description:JNK-1 was purchased from Upstate Cell Signaling Solutions (formerly Upstate Biotechnology).
Residue:427
BDBM50392989
NameBDBM50392989
Synonyms:CHEMBL2152389
TypeSmall organic molecule
Emp. Form.C28H25N3O5
Mol. Mass.483.5152
SMILESCOC(=O)c1c(Cc2ccc(cc2)C(=O)NC2(CO)CC2)c(=O)c2cccnc2n1-c1ccccc1