Reaction Details
TargetMitogen-activated protein kinase 8
LigandBDBM50392984
Substrate/Competitorn/a
Meas. Tech.ChEMBL_853502 (CHEMBL2153879)
EC50 3300±n/a nM
Citation Haynes, NEScott, NRChen, LCJanson, CALi, JKLukacs, CMRailkar, ATozzo, EWhittard, TBrown, NFCheung, AW Identification of an Adamantyl Azaquinolone JNK Selective Inhibitor. ACS Med Chem Lett3:764-768 (2012) 
 
Mitogen-activated protein kinase 8
Name:Mitogen-activated protein kinase 8
Type:Enzyme
Mol. Mass.:48297.57
Organism:Homo sapiens (Human)
Description:JNK-1 was purchased from Upstate Cell Signaling Solutions (formerly Upstate Biotechnology).
Residue:427
BDBM50392984
NameBDBM50392984
Synonyms:CHEMBL2152384
TypeSmall organic molecule
Emp. Form.C30H31N3O5
Mol. Mass.513.5842
SMILESCOC(=O)c1c(Cc2ccc(cc2)C(=O)N[C@H](CO)C(C)(C)C)c(=O)c2cccnc2n1-c1ccccc1