Reaction Details
TargetHexokinase-4
LigandBDBM50394684
Substrate/Competitorn/a
Meas. Tech.ChEMBL_858378 (CHEMBL2168593)
EC50 188±n/a nM
Citation Pfefferkorn, JAGuzman-Perez, ALitchfield, JAiello, RTreadway, JLPettersen, JMinich, MLFilipski, KJJones, CSTu, MAspnes, GRisley, HBian, JStevens, BDBourassa, PD'Aquila, TBaker, LBarucci, NRobertson, ASBourbonais, FDerksen, DRMacdougall, MCabrera, OChen, JLapworth, ALLandro, JAZavadoski, WJAtkinson, KHaddish-Berhane, NTan, BYao, LKosa, REVarma, MVFeng, BDuignan, DBEl-Kattan, AMurdande, SLiu, SAmmirati, MKnafels, JDasilva-Jardine, PSweet, LLiras, SRolph, TP Discovery of (S)-6-(3-cyclopentyl-2-(4-(trifluoromethyl)-1H-imidazol-1-yl)propanamido)nicotinic acid as a hepatoselective glucokinase activator clinical candidate for treating type 2 diabetes mellitus. J Med Chem55:1318-33 (2012) 
 
Hexokinase-4
Name:Hexokinase-4
Type:Enzyme
Mol. Mass.:52175.81
Organism:Homo sapiens (Human)
Description:P35557
Residue:465
BDBM50394684
NameBDBM50394684
Synonyms:CHEMBL2165615
TypeSmall organic molecule
Emp. Form.C22H20N6O4
Mol. Mass.432.432
SMILESCN(C)C(=O)c1ncc(Oc2cc(cc3oc(C)cc23)C(=O)Nc2cnc(C)cn2)cn1