Reaction Details
TargetHexokinase-4
LigandBDBM50394692
Substrate/Competitorn/a
Meas. Tech.ChEMBL_858378 (CHEMBL2168593)
EC50>10000±n/a nM
Citation Pfefferkorn, JAGuzman-Perez, ALitchfield, JAiello, RTreadway, JLPettersen, JMinich, MLFilipski, KJJones, CSTu, MAspnes, GRisley, HBian, JStevens, BDBourassa, PD'Aquila, TBaker, LBarucci, NRobertson, ASBourbonais, FDerksen, DRMacdougall, MCabrera, OChen, JLapworth, ALLandro, JAZavadoski, WJAtkinson, KHaddish-Berhane, NTan, BYao, LKosa, REVarma, MVFeng, BDuignan, DBEl-Kattan, AMurdande, SLiu, SAmmirati, MKnafels, JDasilva-Jardine, PSweet, LLiras, SRolph, TP Discovery of (S)-6-(3-cyclopentyl-2-(4-(trifluoromethyl)-1H-imidazol-1-yl)propanamido)nicotinic acid as a hepatoselective glucokinase activator clinical candidate for treating type 2 diabetes mellitus. J Med Chem55:1318-33 (2012) 
 
Hexokinase-4
Name:Hexokinase-4
Type:Enzyme
Mol. Mass.:52175.81
Organism:Homo sapiens (Human)
Description:P35557
Residue:465
BDBM50394692
NameBDBM50394692
Synonyms:CHEMBL2165622
TypeSmall organic molecule
Emp. Form.C18H19F3N4O3
Mol. Mass.396.3637
SMILESOC(=O)c1ccnc(NC(=O)[C@H](CC2CCCC2)n2cnc(c2)C(F)(F)F)c1