Reaction Details
TargetAurora kinase B
LigandBDBM50394796
Substrate/Competitorn/a
Meas. Tech.ChEMBL_859400 (CHEMBL2167306)
Kd 2.9±n/a nM
Citation Liu, GAbraham, STran, LVickers, TDXu, SHadd, MJQuiambao, SHolladay, MWHua, HFord Pulido, JMGunawardane, RNDavis, MIEichelberger, SRApuy, JLGitnick, DGardner, MFJames, JBreider, MABelli, BArmstrong, RCTreiber, DK Discovery of highly potent and selective pan-Aurora kinase inhibitors with enhanced in vivo antitumor therapeutic index. J Med Chem55:3250-60 (2012) 
 
Aurora kinase B
Name:Aurora kinase B
Type:Protein
Mol. Mass.:39327.72
Organism:Homo sapiens (Human)
Description:Q96GD4
Residue:344
BDBM50394796
NameBDBM50394796
Synonyms:CHEMBL2163410
TypeSmall organic molecule
Emp. Form.C29H38N10O2S
Mol. Mass.590.743
SMILESCN1CCN(CCO[C@@H]2CCN(CC(=O)Nc3ccc(Sc4nc(Nc5cc(C)[nH]n5)c5cccn5n4)cc3)C2)CC1