Reaction Details
TargetAurora kinase A
LigandBDBM50394791
Substrate/Competitorn/a
Meas. Tech.ChEMBL_859403 (CHEMBL2167309)
Kd 17±n/a nM
Citation Liu, GAbraham, STran, LVickers, TDXu, SHadd, MJQuiambao, SHolladay, MWHua, HFord Pulido, JMGunawardane, RNDavis, MIEichelberger, SRApuy, JLGitnick, DGardner, MFJames, JBreider, MABelli, BArmstrong, RCTreiber, DK Discovery of highly potent and selective pan-Aurora kinase inhibitors with enhanced in vivo antitumor therapeutic index. J Med Chem55:3250-60 (2012) 
 
Aurora kinase A
Name:Aurora kinase A
Type:Serine/threonine-protein kinase
Mol. Mass.:45830.98
Organism:Homo sapiens (Human)
Description:O14965
Residue:403
BDBM50394791
NameBDBM50394791
Synonyms:CHEMBL2163397
TypeSmall organic molecule
Emp. Form.C27H32N8O2S
Mol. Mass.532.66
SMILESCc1cc(Nc2nc(Sc3ccc(NC(=O)CN4CCC(C4)C(=O)C(C)(C)C)cc3)nn3cccc23)n[nH]1