Reaction Details
TargetAurora kinase A
LigandBDBM50352318
Substrate/Competitorn/a
Meas. Tech.ChEMBL_859403 (CHEMBL2167309)
Kd 15±n/a nM
Citation Liu, GAbraham, STran, LVickers, TDXu, SHadd, MJQuiambao, SHolladay, MWHua, HFord Pulido, JMGunawardane, RNDavis, MIEichelberger, SRApuy, JLGitnick, DGardner, MFJames, JBreider, MABelli, BArmstrong, RCTreiber, DK Discovery of highly potent and selective pan-Aurora kinase inhibitors with enhanced in vivo antitumor therapeutic index. J Med Chem55:3250-60 (2012) 
 
Aurora kinase A
Name:Aurora kinase A
Type:Serine/threonine-protein kinase
Mol. Mass.:45830.98
Organism:Homo sapiens (Human)
Description:O14965
Residue:403
BDBM50352318
NameBDBM50352318
Synonyms:CHEMBL1822658
TypeSmall organic molecule
Emp. Form.C28H27FN8O3S
Mol. Mass.574.629
SMILESCc1cc(Nc2nc(Sc3ccc(NC(=O)CN4C[C@H](O)[C@H](C4)Oc4ccc(F)cc4)cc3)nn3cccc23)n[nH]1