Reaction Details
TargetCeramide glucosyltransferase
LigandBDBM50394817
Substrate/Competitorn/a
Meas. Tech.ChEMBL_859946 (CHEMBL2167349)
IC50 4±n/a nM
Citation Richards, SLarson, CJKoltun, ESHanel, AChan, VNachtigall, JHarrison, AAay, NDu, HArcalas, AGalan, AZhang, JZhang, WWon, KATam, DQian, FWang, TFinn, POgilvie, KRosen, JAoyama, RPlonowski, ACancilla, BBentzien, FYakes, MMohan, RLamb, PNuss, JKearney, P Discovery and characterization of an inhibitor of glucosylceramide synthase. J Med Chem55:4322-35 (2012) 
 
Ceramide glucosyltransferase
Name:Ceramide glucosyltransferase
Type:PROTEIN
Mol. Mass.:44859.25
Organism:Homo sapiens (Human)
Description:ChEMBL_1435474
Residue:394
BDBM50394817
NameBDBM50394817
Synonyms:CHEMBL2163832
TypeSmall organic molecule
Emp. Form.C24H25Cl4N3O2
Mol. Mass.529.286
SMILESCN1CCN(CC1)C(=O)[C@H](Cc1ccc(Cl)cc1Cl)NC(=O)C1(CC1)c1ccc(Cl)cc1Cl