Reaction Details
TargetCeramide glucosyltransferase
LigandBDBM50394804
Substrate/Competitorn/a
Meas. Tech.ChEMBL_859947 (CHEMBL2167350)
IC50 2±n/a nM
Citation Richards, SLarson, CJKoltun, ESHanel, AChan, VNachtigall, JHarrison, AAay, NDu, HArcalas, AGalan, AZhang, JZhang, WWon, KATam, DQian, FWang, TFinn, POgilvie, KRosen, JAoyama, RPlonowski, ACancilla, BBentzien, FYakes, MMohan, RLamb, PNuss, JKearney, P Discovery and characterization of an inhibitor of glucosylceramide synthase. J Med Chem55:4322-35 (2012) 
 
Ceramide glucosyltransferase
Name:Ceramide glucosyltransferase
Type:PROTEIN
Mol. Mass.:44859.25
Organism:Homo sapiens (Human)
Description:ChEMBL_1435474
Residue:394
BDBM50394804
NameBDBM50394804
Synonyms:CHEMBL2163828
TypeSmall organic molecule
Emp. Form.C27H29BrF3N3O3
Mol. Mass.580.437
SMILESNC1C[C@@H]2CC[C@H](C1)N2C(=O)[C@H](Cc1ccc(Br)cc1)NC(=O)C1(CC1)c1ccc(OC(F)(F)F)cc1