Reaction Details
TargetCeramide glucosyltransferase
LigandBDBM50394812
Substrate/Competitorn/a
Meas. Tech.ChEMBL_859947 (CHEMBL2167350)
IC50 2±n/a nM
Citation Richards, SLarson, CJKoltun, ESHanel, AChan, VNachtigall, JHarrison, AAay, NDu, HArcalas, AGalan, AZhang, JZhang, WWon, KATam, DQian, FWang, TFinn, POgilvie, KRosen, JAoyama, RPlonowski, ACancilla, BBentzien, FYakes, MMohan, RLamb, PNuss, JKearney, P Discovery and characterization of an inhibitor of glucosylceramide synthase. J Med Chem55:4322-35 (2012) 
 
Ceramide glucosyltransferase
Name:Ceramide glucosyltransferase
Type:PROTEIN
Mol. Mass.:44859.25
Organism:Homo sapiens (Human)
Description:ChEMBL_1435474
Residue:394
BDBM50394812
NameBDBM50394812
Synonyms:CHEMBL2163838
TypeSmall organic molecule
Emp. Form.C24H27Cl4N3O2
Mol. Mass.531.302
SMILESCN(C)CCN(C)C(=O)[C@H](Cc1ccc(Cl)cc1Cl)NC(=O)C1(CC1)c1ccc(Cl)cc1Cl