Reaction Details
TargetA disintegrin and metalloproteinase with thrombospondin motifs 5
LigandBDBM50395717
Substrate/Competitorn/a
Meas. Tech.ChEMBL_860056 (CHEMBL2167992)
IC50 3800±n/a nM
Citation Deng, HO'Keefe, HDavie, CPLind, KEAcharya, RAFranklin, GJLarkin, JMatico, RNeeb, MThompson, MMLohr, TGross, JWCentrella, PAO'Donovan, GKBedard, KLvan Vloten, KMataruse, SSkinner, SRBelyanskaya, SLCarpenter, TYShearer, TWClark, MACuozzo, JWArico-Muendel, CCMorgan, BA Discovery of highly potent and selective small molecule ADAMTS-5 inhibitors that inhibit human cartilage degradation via encoded library technology (ELT). J Med Chem55:7061-79 (2012) 
 
A disintegrin and metalloproteinase with thrombospondin motifs 5
Name:A disintegrin and metalloproteinase with thrombospondin motifs 5
Type:Enzyme
Mol. Mass.:101769.09
Organism:Homo sapiens (Human)
Description:Q9UNA0
Residue:930
BDBM50395717
NameBDBM50395717
Synonyms:CHEMBL2164110
TypeSmall organic molecule
Emp. Form.C32H40N8O2S2
Mol. Mass.632.842
SMILESCCCc1ccc(cc1)S(=O)(=O)NC[C@H]1CCCN1c1nc(NCCC2CC2)nc(NCc2csc(n2)-c2ccccc2)n1