Reaction Details
TargetA disintegrin and metalloproteinase with thrombospondin motifs 5
LigandBDBM50395713
Substrate/Competitorn/a
Meas. Tech.ChEMBL_860056 (CHEMBL2167992)
IC50 2140±n/a nM
Citation Deng, HO'Keefe, HDavie, CPLind, KEAcharya, RAFranklin, GJLarkin, JMatico, RNeeb, MThompson, MMLohr, TGross, JWCentrella, PAO'Donovan, GKBedard, KLvan Vloten, KMataruse, SSkinner, SRBelyanskaya, SLCarpenter, TYShearer, TWClark, MACuozzo, JWArico-Muendel, CCMorgan, BA Discovery of highly potent and selective small molecule ADAMTS-5 inhibitors that inhibit human cartilage degradation via encoded library technology (ELT). J Med Chem55:7061-79 (2012) 
 
A disintegrin and metalloproteinase with thrombospondin motifs 5
Name:A disintegrin and metalloproteinase with thrombospondin motifs 5
Type:Enzyme
Mol. Mass.:101769.09
Organism:Homo sapiens (Human)
Description:Q9UNA0
Residue:930
BDBM50395713
NameBDBM50395713
Synonyms:CHEMBL2164116
TypeSmall organic molecule
Emp. Form.C33H42N8O3S2
Mol. Mass.662.868
SMILESCCCc1ccc(cc1)S(=O)(=O)NC[C@H]1CCCN1c1nc(NCC2CCOCC2)nc(NCc2csc(n2)-c2ccccc2)n1