Reaction Details
TargetA disintegrin and metalloproteinase with thrombospondin motifs 5
LigandBDBM50168737
Substrate/Competitorn/a
Meas. Tech.ChEMBL_860056 (CHEMBL2167992)
IC50 6.3±n/a nM
Citation Deng, HO'Keefe, HDavie, CPLind, KEAcharya, RAFranklin, GJLarkin, JMatico, RNeeb, MThompson, MMLohr, TGross, JWCentrella, PAO'Donovan, GKBedard, KLvan Vloten, KMataruse, SSkinner, SRBelyanskaya, SLCarpenter, TYShearer, TWClark, MACuozzo, JWArico-Muendel, CCMorgan, BA Discovery of highly potent and selective small molecule ADAMTS-5 inhibitors that inhibit human cartilage degradation via encoded library technology (ELT). J Med Chem55:7061-79 (2012) 
 
A disintegrin and metalloproteinase with thrombospondin motifs 5
Name:A disintegrin and metalloproteinase with thrombospondin motifs 5
Type:Enzyme
Mol. Mass.:101769.09
Organism:Homo sapiens (Human)
Description:Q9UNA0
Residue:930
BDBM50168737
NameBDBM50168737
Synonyms:(2R,3R)-1-[4-(2-Chloro-4-fluoro-benzyloxy)-benzenesulfonyl]-3-hydroxy-3-methyl-piperidine-2-carboxylic acid hydroxyamide | CHEMBL187092
TypeSmall organic molecule
Emp. Form.C20H22ClFN2O6S
Mol. Mass.472.915
SMILESC[C@@]1(O)CCCN([C@H]1C(=O)NO)S(=O)(=O)c1ccc(OCc2ccc(F)cc2Cl)cc1