Reaction Details
TargetHigh affinity cAMP-specific 3',5'-cyclic phosphodiesterase 7A
LigandBDBM50397053
Substrate/Competitorn/a
Meas. Tech.ChEMBL_863498 (CHEMBL2174779)
IC50 27±n/a nM
Citation Banerjee, APatil, SPawar, MYGullapalli, SGupta, PKGandhi, MNBhateja, DKBajpai, MSangana, RRGudi, GSKhairatkar-Joshi, NGharat, LA Imidazopyridazinones as novel PDE7 inhibitors: SAR and in vivo studies in Parkinson's disease model. Bioorg Med Chem Lett22:6286-91 (2012) 
 
High affinity cAMP-specific 3',5'-cyclic phosphodiesterase 7A
Name:High affinity cAMP-specific 3',5'-cyclic phosphodiesterase 7A
Type:Enzyme
Mol. Mass.:55514.96
Organism:Homo sapiens (Human)
Description:Q13946
Residue:482
BDBM50397053
NameBDBM50397053
Synonyms:CHEMBL2171422
TypeSmall organic molecule
Emp. Form.C24H32N6O2
Mol. Mass.436.5499
SMILESCOc1cc(ccc1-c1nc2c(C)nn(C3CCCCC3)c(=O)c2[nH]1)N1CCC(N)CC1