Reaction Details
TargetLysophosphatidic acid receptor 3
LigandBDBM50398090
Substrate/Competitorn/a
Meas. Tech.ChEMBL_873924 (CHEMBL2184760)
IC50 65±n/a nM
Citation Qian, YHamilton, MSidduri, AGabriel, SRen, YPeng, RKondru, RNarayanan, ATruitt, THamid, RChen, YZhang, LFretland, AJSanchez, RAChang, KCLucas, MSchoenfeld, RCLaine, DFuentes, MEStevenson, CSBudd, DC Discovery of highly selective and orally active lysophosphatidic acid receptor-1 antagonists with potent activity on human lung fibroblasts. J Med Chem55:7920-39 (2012) 
 
Lysophosphatidic acid receptor 3
Name:Lysophosphatidic acid receptor 3
Type:Enzyme
Mol. Mass.:40149.72
Organism:Homo sapiens (Human)
Description:Q9UBY5
Residue:353
BDBM50398090
NameBDBM50398090
Synonyms:CHEMBL2182050 | US9321738, 13
TypeSmall organic molecule
Emp. Form.C30H28F3N5O5S
Mol. Mass.627.634
SMILESC[C@@H](OC(=O)Nc1c(nnn1C)-c1ccc(cc1)-c1ccc(cc1)C1(CC1)C(=O)NS(C)(=O)=O)c1cccc(c1)C(F)(F)F