Reaction Details
TargetLysophosphatidic acid receptor 1
LigandBDBM50398094
Substrate/Competitorn/a
Meas. Tech.ChEMBL_873916 (CHEMBL2184752)
IC50 20±n/a nM
Citation Qian, YHamilton, MSidduri, AGabriel, SRen, YPeng, RKondru, RNarayanan, ATruitt, THamid, RChen, YZhang, LFretland, AJSanchez, RAChang, KCLucas, MSchoenfeld, RCLaine, DFuentes, MEStevenson, CSBudd, DC Discovery of highly selective and orally active lysophosphatidic acid receptor-1 antagonists with potent activity on human lung fibroblasts. J Med Chem55:7920-39 (2012) 
 
Lysophosphatidic acid receptor 1
Name:Lysophosphatidic acid receptor 1
Type:Enzyme
Mol. Mass.:41120.55
Organism:Homo sapiens (Human)
Description:Q92633
Residue:364
BDBM50398094
NameBDBM50398094
Synonyms:CHEMBL2182044 | US9321738, 11
TypeSmall organic molecule
Emp. Form.C28H25FN4O4
Mol. Mass.500.5209
SMILESC[C@@H](OC(=O)Nc1c(nnn1C)-c1ccc(cc1F)-c1ccc(cc1)C1(CC1)C(O)=O)c1ccccc1