Reaction Details
TargetDelta-type opioid receptor
LigandBDBM50398757
Substrate/Competitorn/a
Meas. Tech.ChEMBL_876451 (CHEMBL2187203)
Ki 17±n/a nM
Citation Ananthan, SSaini, SKDersch, CMXu, HMcGlinchey, NGiuvelis, DBilsky, EJRothman, RB 14-Alkoxy- and 14-acyloxypyridomorphinans:µ agonist/d antagonist opioid analgesics with diminished tolerance and dependence side effects. J Med Chem55:8350-63 (2012) 
 
Delta-type opioid receptor
Name:Delta-type opioid receptor
Type:G Protein-Coupled Receptor (GPCR)
Mol. Mass.:40382.98
Organism:Homo sapiens (Human)
Description:Competition binding assays were carried out using membrane preparations from transfected HN9.10 cells that constitutively expressed the delta opioid receptor.
Residue:372
BDBM50398757
NameBDBM50398757
Synonyms:CHEMBL2179660
TypeSmall organic molecule
Emp. Form.C33H27ClN2O4
Mol. Mass.551.031
SMILESCN1CC[C@@]23[C@H]4Oc5c2c(C[C@@H]1[C@@]3(Cc1cc(cnc41)-c1ccc(Cl)cc1)OC(=O)c1ccccc1)ccc5O