Reaction Details
TargetKappa-type opioid receptor
LigandBDBM50398753
Substrate/Competitorn/a
Meas. Tech.ChEMBL_876434 (CHEMBL2186795)
EC50 26±n/a nM
Citation Ananthan, SSaini, SKDersch, CMXu, HMcGlinchey, NGiuvelis, DBilsky, EJRothman, RB 14-Alkoxy- and 14-acyloxypyridomorphinans:µ agonist/d antagonist opioid analgesics with diminished tolerance and dependence side effects. J Med Chem55:8350-63 (2012) 
 
Kappa-type opioid receptor
Name:Kappa-type opioid receptor
Type:G Protein-Coupled Receptor (GPCR)
Mol. Mass.:42648.76
Organism:Homo sapiens (Human)
Description:P41145
Residue:380
BDBM50398753
NameBDBM50398753
Synonyms:CHEMBL2179658
TypeSmall organic molecule
Emp. Form.C37H33ClN2O4
Mol. Mass.605.122
SMILESOc1ccc2C[C@H]3N(CC4CC4)CC[C@@]45[C@@H](Oc1c24)c1ncc(cc1C[C@@]35OC(=O)Cc1ccccc1)-c1ccc(Cl)cc1