Reaction Details
TargetKappa-type opioid receptor
LigandBDBM50398756
Substrate/Competitorn/a
Meas. Tech.ChEMBL_876434 (CHEMBL2186795)
EC50 27±n/a nM
Citation Ananthan, SSaini, SKDersch, CMXu, HMcGlinchey, NGiuvelis, DBilsky, EJRothman, RB 14-Alkoxy- and 14-acyloxypyridomorphinans:µ agonist/d antagonist opioid analgesics with diminished tolerance and dependence side effects. J Med Chem55:8350-63 (2012) 
 
Kappa-type opioid receptor
Name:Kappa-type opioid receptor
Type:G Protein-Coupled Receptor (GPCR)
Mol. Mass.:42648.76
Organism:Homo sapiens (Human)
Description:P41145
Residue:380
BDBM50398756
NameBDBM50398756
Synonyms:CHEMBL2179650
TypeSmall organic molecule
Emp. Form.C36H33ClN2O3
Mol. Mass.577.112
SMILESOc1ccc2C[C@H]3N(CC4CC4)CC[C@@]45[C@@H](Oc1c24)c1ncc(cc1C[C@@]35OCc1ccccc1)-c1ccc(Cl)cc1