Reaction Details
TargetKappa-type opioid receptor
LigandBDBM50398761
Substrate/Competitorn/a
Meas. Tech.ChEMBL_876444 (CHEMBL2187196)
Ki 468±n/a nM
Citation Ananthan, SSaini, SKDersch, CMXu, HMcGlinchey, NGiuvelis, DBilsky, EJRothman, RB 14-Alkoxy- and 14-acyloxypyridomorphinans:µ agonist/d antagonist opioid analgesics with diminished tolerance and dependence side effects. J Med Chem55:8350-63 (2012) 
 
Kappa-type opioid receptor
Name:Kappa-type opioid receptor
Type:G Protein-Coupled Receptor (GPCR)
Mol. Mass.:42648.76
Organism:Homo sapiens (Human)
Description:P41145
Residue:380
BDBM50398761
NameBDBM50398761
Synonyms:CHEMBL611438
TypeSmall organic molecule
Emp. Form.C26H23ClN2O3
Mol. Mass.446.925
SMILESCN1CC[C@@]23[C@H]4Oc5c2c(C[C@@H]1[C@]3(O)Cc1cc(cnc41)-c1ccc(Cl)cc1)ccc5O