Reaction Details
TargetKappa-type opioid receptor
LigandBDBM50080467
Substrate/Competitorn/a
Meas. Tech.ChEMBL_876444 (CHEMBL2187196)
Ki 20±n/a nM
Citation Ananthan, SSaini, SKDersch, CMXu, HMcGlinchey, NGiuvelis, DBilsky, EJRothman, RB 14-Alkoxy- and 14-acyloxypyridomorphinans:µ agonist/d antagonist opioid analgesics with diminished tolerance and dependence side effects. J Med Chem55:8350-63 (2012) 
 
Kappa-type opioid receptor
Name:Kappa-type opioid receptor
Type:G Protein-Coupled Receptor (GPCR)
Mol. Mass.:42648.76
Organism:Homo sapiens (Human)
Description:P41145
Residue:380
BDBM50080467
NameBDBM50080467
Synonyms:5'-(Chlorophenyl)-17-(cyclopropylmethyl) -6,7-didehydro-3,14-dihydroxy-4,5alpha-epoxypyrido-[2',3':6,7]morphinan | CHEMBL325600
TypeSmall organic molecule
Emp. Form.C29H27ClN2O3
Mol. Mass.486.989
SMILESOc1ccc2C[C@H]3N(CC4CC4)CC[C@@]45C(Oc1c24)c1ncc(cc1C[C@@]35O)-c1ccc(Cl)cc1