Reaction Details
TargetKappa-type opioid receptor
LigandBDBM50398757
Substrate/Competitorn/a
Meas. Tech.ChEMBL_876449 (CHEMBL2187201)
Ki 112±n/a nM
Citation Ananthan, SSaini, SKDersch, CMXu, HMcGlinchey, NGiuvelis, DBilsky, EJRothman, RB 14-Alkoxy- and 14-acyloxypyridomorphinans:µ agonist/d antagonist opioid analgesics with diminished tolerance and dependence side effects. J Med Chem55:8350-63 (2012) 
 
Kappa-type opioid receptor
Name:Kappa-type opioid receptor
Type:G Protein-Coupled Receptor (GPCR)
Mol. Mass.:42648.76
Organism:Homo sapiens (Human)
Description:P41145
Residue:380
BDBM50398757
NameBDBM50398757
Synonyms:CHEMBL2179660
TypeSmall organic molecule
Emp. Form.C33H27ClN2O4
Mol. Mass.551.031
SMILESCN1CC[C@@]23[C@H]4Oc5c2c(C[C@@H]1[C@@]3(Cc1cc(cnc41)-c1ccc(Cl)cc1)OC(=O)c1ccccc1)ccc5O