Reaction Details
TargetKappa-type opioid receptor
LigandBDBM50398759
Substrate/Competitorn/a
Meas. Tech.ChEMBL_876449 (CHEMBL2187201)
Ki 1.6±n/a nM
Citation Ananthan, SSaini, SKDersch, CMXu, HMcGlinchey, NGiuvelis, DBilsky, EJRothman, RB 14-Alkoxy- and 14-acyloxypyridomorphinans:µ agonist/d antagonist opioid analgesics with diminished tolerance and dependence side effects. J Med Chem55:8350-63 (2012) 
 
Kappa-type opioid receptor
Name:Kappa-type opioid receptor
Type:G Protein-Coupled Receptor (GPCR)
Mol. Mass.:42648.76
Organism:Homo sapiens (Human)
Description:P41145
Residue:380
BDBM50398759
NameBDBM50398759
Synonyms:CHEMBL2179655
TypeSmall organic molecule
Emp. Form.C35H31ClN2O3
Mol. Mass.563.085
SMILESCN1CC[C@@]23[C@H]4Oc5c2c(C[C@@H]1[C@@]3(Cc1cc(cnc41)-c1ccc(Cl)cc1)OC\C=C\c1ccccc1)ccc5O