Reaction Details
TargetKappa-type opioid receptor
LigandBDBM50398765
Substrate/Competitorn/a
Meas. Tech.ChEMBL_876449 (CHEMBL2187201)
Ki 5.4±n/a nM
Citation Ananthan, SSaini, SKDersch, CMXu, HMcGlinchey, NGiuvelis, DBilsky, EJRothman, RB 14-Alkoxy- and 14-acyloxypyridomorphinans:µ agonist/d antagonist opioid analgesics with diminished tolerance and dependence side effects. J Med Chem55:8350-63 (2012) 
 
Kappa-type opioid receptor
Name:Kappa-type opioid receptor
Type:G Protein-Coupled Receptor (GPCR)
Mol. Mass.:42648.76
Organism:Homo sapiens (Human)
Description:P41145
Residue:380
BDBM50398765
NameBDBM50398765
Synonyms:CHEMBL2179649
TypeSmall organic molecule
Emp. Form.C30H29ClN2O3
Mol. Mass.501.016
SMILESCO[C@]12Cc3cc(cnc3[C@@H]3Oc4c5c(C[C@H]1N(CC1CC1)CC[C@@]235)ccc4O)-c1ccc(Cl)cc1